Workday Extend errors
22 errors
6lookups
✓verified
Extend PMD Failed to Resolve a Definition
PMD error: failed to resolve 'workerCard' in presentation model definition appWorkerView
Workday Extend
6lookups
✓verified
Extend PMD 'Unknown Variable' Error When Clearing a Widget Value With Double Quotes
Exception thrown while processing 'onChange' event in tag of type 'radioGroup' with id 'ExemptionReason' declared at 'reviseEvent'
Workday Extend
6lookups
✓verified
Extend Edit Page Returns a Bare Internal Server Error on Submit
Internal Server Error
Workday Extend
6lookups
✓verified
Extend PMD Fails to Compile: Failed to Generate WUL From PMD Snippet
Failed to generate WUL from PMD snippet... Exception: A failure occurred while processing your request. Contact your administrator.
Workday Extend
5lookups
✓verified
Extend PMD App Attribute Reference Fails With Unknown Variable
Internal Server Error. [F5S|********|********]
Workday Extend
5lookups
✓verified
Prism Dataset Load Fails with "Failed While Retrieving Data From the Source"
Failed while retrieving data from the source.
Workday Extend
5lookups
✓verified
Custom Validation Error Not Displayed in Extend App (PMD Binding Typo)
Page Error: invalid request: validation errors
Workday Extend
5lookups
✓verified
Extend Orchestration: JSON Path Binding Inserts a Leading Space, Invalidating the WID
<wd:Worker_Reference>
Workday Extend
5lookups
✓verified
Extend Model Component Build Fails With Generic Exception, Real Cause Hidden in Extend Logs Tab
java.lang.Exception: Build failed with an error. Check the build logs in the Workday Extend Tool Window for additional information.
Workday Extend
3lookups
✓verified
Extend App Job Requisition Retrieval Fails with "Content Is Not Allowed in Prolog" XSLT Error
STUDIO ERROR: Content is not allowed in prolog.
Workday Extend
3lookups
✓verified
Extend Expression Parser Rejects 'for' as a Property Name (Reserved Word Conflict)
WelTokenType.identifier expected, got 'for'
Workday Extend
2lookups
✓verified
Extend Business Object Build Fails with Multiple Model Validation Errors on Deploy
Validation Error: invalid security domain [mySecurityDomain] in business object [Widgets]
Workday Extend
2lookups
✓verified
Extend App Version Stays In-Flight and Waiting To Be Scheduled
Version: In-flight
Workday Extend
2lookups
✓verified
Extend App Model Component Won't Install Until Next Weekly Update
The app can't be installed because an app component isn't available in the tenant. The app component will be installed with the next weekly update.
Workday Extend
2lookups
✓verified
Extend REST API Custom Object PUT Fails With Misleading 403 Insufficient Permissions
"error": "user has insufficient permissions" STATUS 403 Forbidden
Workday Extend
2lookups
✓verified
PMD Validations Tag Fails with Unknown Property Found Error After Switching from EL to PMD Scripting
Page Error - Internal Server Error. [F5Sl********l********] Unknown Property found: value Script Excerpt: string:length(txtArea.value) <= 5000
Workday Extend
2lookups
✓verified
Extend App RaaS Report Call Times Out for Non-Admin Users
org.springframework.web.client.ResourceAccessException: I/O error on GET request for "https://api.workday.com/raas/<ISU_NAME>/<REPORT_ALIAS>": Read timed out; nested exception is java.net.SocketTimeou
Workday Extend
2lookups
✓verified
Extend Custom Business Object Instance Shows No Task Runner When Clicked
no task runner
Workday Extend
2lookups
✓verified
Extend App Fails to Download on Windows After Being Deployed From Mac
Unable to fetch app(s)
Workday Extend
1lookups
✓verified
Extend Custom Object PATCH Returns 403 Forbidden When the Body Carries Escaped HTML
403 Forbidden
Workday Extend
1lookups
✓verified
Convert Report to WQL Fails: This Field Is Missing an Adhoc Alias
This field is missing an adhoc alias
Workday Extend
1lookups
✓verified
Extend PMD Endpoints Never Register Because the Key Is Lowercase
Unknown Variable found: scorecards
Workday Extend