Workday errors in plain English.

Submit an Error

Browse errors by product area

154 translated errors

SOAP Web Services 12 errors

11lookups
✓verified
"Invalid Request": ISU Missing Domain Permission
SOAP-ENV:Client.validationError: Invalid request
SOAP Web Services updated Jun 2026
10lookups
✓verified
Invalid ID Value for a Reference ID Type
SOAP-ENV:Client.validationError: Invalid ID value. 'ABC123' is not a valid ID value for type Organization_Reference_ID
SOAP Web Services updated Jul 2026
8lookups
✓verified
Validation Error: Required Element Missing in Request
SOAP-ENV:Client.validationError: Validation error occurred. Required element 'Position_ID' is missing from the request
SOAP Web Services updated Jun 2026
6lookups
✓verified
Blanking a Reference Field in a SOAP Request With an Empty ID Element Fails Validation
<wd:Work_Space_Reference><wd:ID wd:type="Location_ID">""</wd:ID></wd:Work_Space_Reference> -- error: Invalid ID values
SOAP Web Services updated Aug 2026
6lookups
✓verified
OX Composite Report Migration Fails: "Specified_Hierarchic_Reference" Validation Error
<faultcode>SOAP-ENV:Client.validationError</faultcode><faultstring>Validation error occurred. The entered information does not meet the restrictions defined for this field. (Specified_Hierarchic_Refer
SOAP Web Services updated Aug 2026
6lookups
✓verified
Reactivate_Organization Fails When Organization_Reference Uses Company_Reference_ID Type
<faultcode>SOAP-ENV:Client.validationError</faultcode><faultstring>Validation error occurred. Invalid ID value. 'SO_001111111' is not a valid ID value for type = 'Company_Reference_ID'</faultstring>
SOAP Web Services updated Aug 2026
5lookups
✓verified
OX Custom Report Migration Fails: "Data_Source_Filter_Reference" Validation Error
SOAP-ENV:Client.validationError : Validation error occurred. The entered information does not meet the restrictions defined for this field. (Data_Source_Filter_Reference).
SOAP Web Services updated Aug 2026
4lookups
✓verified
SOAP-ENV:Client.validationError 'Invalid Request' When Testing Outside Studio/EIB
<faultcode>SOAP-ENV:Client.validationError</faultcode> <faultstring>Invalid request</faultstring>
SOAP Web Services updated Jul 2026
4lookups
✓verified
Create Position Fails: Custom Organization Type Required for Position Assignment
SOAP-ENV:Client.validationError : Validation error occurred. At least one of the Custom organization types is required based on the position assignment details settings but has no entries.
SOAP Web Services updated Aug 2026
4lookups
✓verified
SOAP Web Service Call With OAuth Bearer Token Returns Invalid Username or Password
<faultstring>invalid username or password</faultstring>
SOAP Web Services updated Aug 2026
4lookups
✓verified
Change_Other_IDs Web Service Rejects Worker_Reference as Invalid Subelement
<SOAP-ENV:Fault xmlns:wd="urn:com.workday/bsvc"><faultcode>SOAP-ENV:Client.validationError</faultcode><faultstring>Validation error occurred. Invalid Subelement Worker_Reference-urn:com.workday/bsvc f
SOAP Web Services updated Aug 2026
3lookups
✓verified
Object Transporter Migration Fails: Custom Report ID Contains Spaces
SOAP-ENV:Client.validationError : Validation error occurred. Invalid ID value. 'REST RPT Feeder Educational Institution' is not a valid ID value for type = 'Custom_Report_ID'
SOAP Web Services updated Aug 2026

REST API 13 errors

10lookups
✓verified
REST Custom Object: Request Body Is Array, Not Object
HTTP 400 Bad Request VALIDATION_ERROR: Expected a JSON object but received a JSON array
REST API updated Jun 2026
9lookups
✓verified
REST API 401: invalid_token / Expired Access Token
HTTP 401 Unauthorized {"error":"invalid_token","error_description":"The access token is invalid or has expired"}
REST API updated Jul 2026
7lookups
✓verified
REST Custom Object 404 "not found: id" Is Often a JSON Syntax Error, Not a Missing Record
Reason: Not Found. Status=404 content={"error":"not found: id"}
REST API updated Aug 2026
6lookups
✓verified
A Working Listener Service Starts Returning 401 Unauthorized When the ISU Password Silently Expires
Message: 1. Message: The remote server returned an error: (401) Unauthorized.
REST API updated Sep 2026
6lookups
✓verified
REST Custom Object: Worker Reference Requires WID, Not Employee_ID
HTTP 400 Bad Request VALIDATION_ERROR: Invalid reference ID. Employee_ID=[ID] is not a valid identifier for this field
REST API updated Jun 2026
6lookups
✓verified
OAuth2 Token Request Fails With Grant Type Not Specified When Body Is JSON
Error code : badrequest
REST API updated Aug 2026
6lookups
✓verified
Workday Studio HTTP-Out DELETE Call Returns 415 Unsupported Media Type
error from returned HTTP status: 415
REST API updated Aug 2026
6lookups
✓verified
REST Custom Object Update Fails: "not found" for a Nested Reference Field's WID
"error": "invalid request: errors have occurred",
REST API updated Aug 2026
5lookups
✓verified
REST API 403 {"error":"permission denied"} After a Successful OAuth2 Token Exchange
403 {"error":"permission denied"}
REST API updated Aug 2026
4lookups
✓verified
REST API 403 Forbidden: Integration System User Lacks Security Access
403 Forbidden
REST API updated Jun 2026
4lookups
✓verified
REST Custom Object Update Fails with Nested Reference Not Found
{"error": "invalid request: errors have occurred", "errors": [{"error": "not found: 97d735c486e7101ae8e5338889040004", "code": "S5", "location": "Line: 3, column: 69"}]}
REST API updated Aug 2026
4lookups
✓verified
Outbound REST GET Suddenly Returns 400 From An Unencoded Value In A Built URL
error from returned HTTP status: 400 <!DOCTYPE html>
REST API updated Sep 2026
2lookups
✓verified
REST Call Returns HTTP 529 Denying Traffic For Tenant
Denying traffic for tenant '2021' due to inability find Supervised Tenant State</error>
REST API updated Sep 2026

Workday Studio 41 errors

11lookups
✓verified
Studio Assembly OutOfMemoryError on Large Files
java.lang.OutOfMemoryError: Java heap space at com.workday.esb.assembly.AssemblyRunner
Workday Studio updated Jul 2026
11lookups
✓verified
Studio Assembly Mediation Error
com.workday.esb.mediation.MediationException: unable to mediate message at step 'splitter-1'
Workday Studio updated Jul 2026
9lookups
✓verified
Studio workday-out-rest: Custom Object Endpoint Path Not Resolving
HTTP 404 Not Found. The requested resource could not be found.
Workday Studio updated Jul 2026
8lookups
✓verified
Studio Splitter XPath Fails: Could Not Find Mapping for Prefix
com.capeclear.mediation.MediationException: Error while parsing XPath expression'/ws:Worker_Sync/ws:Worker', namespace mappings='{cc=http://www.capeclear.com/assembly/10, cloud=urn:com.workday.esb.clo
Workday Studio updated Aug 2026
7lookups
✓verified
Studio Copy Step Fails with NoMediationMessageContentException Empty Message
Com.capeclear.mediation.logging.NoMediationMessageContentException. Empty message received on step id Copy.
Workday Studio updated Aug 2026
6lookups
✓verified
Studio Send Email Step Fails: Endpoint Username Does Not Appear to Be Correct
Failed to deploy - Failed to apply awares for Out transport '{http://www.capeclear.com/assembly/10}email-out', reason: The endpoint username masked@example.com in email out transport id=EmailOut does
Workday Studio updated Sep 2026
6lookups
✓verified
Studio httpput Retries Silently Break Content-Type After a 429
com.capeclear.capeconnect.transport.BadRequestException: error from returned HTTP status: 429 Too Many Requests URL= : Retrying in 13000 msec. (esbHttpRequestId=65146305-0d26-4457-094f-1d265d177c66)
Workday Studio updated Jul 2026
6lookups
✓verified
Update Workday Studio Fails With Conflicting Dependency Pointing at Report Designer
Conflicting Dependency
Workday Studio updated Sep 2026
6lookups
✓verified
Studio Debug Fails With Unable to Find Valid Certification Path While the Deployed Integration Succeeds
Root Cause: sun.security.provider.certpath.SunCertPathBuilderException: unable to find valid certification path to requested target
Workday Studio updated Sep 2026
6lookups
✓verified
Studio Store Step Fails with Invalid Schema Duration PnullD
com.capeclear.mediation.MediationException: store.step.problem: cloud, OBFUSCATED_TENANT_ID_UNAVAILABLE Root Cause: com.capeclear.serialization.types.TypesException: Invalid Schema duration 'PnullD'.
Workday Studio updated Aug 2026
5lookups
✓verified
Studio xpathF Fails With Namespace Prefix Has Not Been Declared Even Though the Response Declares It
Unhandled Exception Error running <INTEGRATION_NAME>: Namespace prefix 'env' has not been declared
Workday Studio updated Sep 2026
5lookups
✓verified
Workday Studio Eclipse IDE Can No Longer Render Non-XML Documents After Reinstall
!ENTRY org.eclipse.jface 4 0
Workday Studio updated Aug 2026
5lookups
✓verified
Studio workday-out-soap Step: "Web Service or Version Is Invalid for the Requested Operation"
Worker null does not exist.Worker does not exist.
Workday Studio updated Jun 2026
5lookups
✓verified
Integration Map Reverse Lookup Fails When a Value Has No Mapping
Error evaluating expression :org.mvel.ExecutableAccessor@211815af reason : unable to resolve property: intsys.integrationMapReverseLookup('Expense Item', props['expenseItem']).get(0).toString()
Workday Studio updated Sep 2026
5lookups
✓verified
Eval Step Cannot Find the Constructor for a Custom Java Class
com.capeclear.mediation.MediationException: application=<APP_NAME> - Error eval step id=StoreReportedTime expression=props['pHashData'] = new com.oic.data.TimeData() failed to evaluate. Reason: unable
Workday Studio updated Sep 2026
4lookups
✓verified
Custom Object Service Intermittent 500 From Multiple Instance Reference ID
Internal Server Error. Status=500 content={"error":"internal error","caseId":"2c36567b-49d7-4fca-86ce-f3c88ade2156"}
Workday Studio updated Aug 2026
4lookups
✓verified
Studio Splitter Fails with "No Split Message Was Generated" Converting JSON to XML
Integration Failed. com.capeclear.mediation.MediationException: No split message was generated.. See the consolidated report for further details
Workday Studio updated Aug 2026
4lookups
✓verified
Studio Reports Illegal to Have Multiple Roots Because the XSLT Emits the Root Inside a for-each
Data is described as XML, but may not be: Illegal to have multiple roots (start tag in epilog?).
Workday Studio updated Sep 2026
4lookups
✓verified
JsonToXML Fails With Character Reference Is an Invalid XML Character on an Emoji in the API Response
Reason: Character reference "&#55357" is an invalid XML character.. Root Cause: org.xml.sax.SAXParseException lineNumber: 255252 columnNumber: 9 Character reference "&#55357" is an invalid XML char
Workday Studio updated Sep 2026
4lookups
✓verified
Studio SSK Custom Bean Fails to Initialize After Import
application=<APP_NAME> - Custom step id=InitializeCoreSSK, ref=SSK109InitializeCore - Error while invoking bean, reason: Unresolved compilation problem
Workday Studio updated Sep 2026
4lookups
✓verified
Studio Integration Fails on Put Integration Message: Invalid Rich Text Internal Syntax
Integration Failed. com.capeclear.mediation.MediationException: application=<APP_NAME> - Workday Out transport id=IntegrationsWebServiceNoStoreMessage encountered problem sending to endpoint 'https://
Workday Studio updated Sep 2026
4lookups
✓verified
Splitter Raises WRONG_DOCUMENT_ERR Only When Not Stepping Through Debug
WRONG_DOCUMENT_ERR: A node is used in a different document than the one that created it. Root Cause: org.w3c.dom.DOMException
Workday Studio updated Sep 2026
4lookups
✓verified
XSLT xsl:element With a Computed Name Fails Without a Namespace Resolver
com.capeclear.mediation.MediationException: application=- Xslt step id=BeforeMerge failed to apply stylesheet BeforeMerge.xsl, reason: Internal error evaluating template rule at line 12 in module fil
Workday Studio updated Sep 2026
4lookups
✓verified
Content Is Not Allowed in Prolog When Delivering a CSV File
com.capeclear.mediation.MediationException: application=<APP_NAME> - Failed to compile XPath expression /ns:entry/ns:link/@href in XPath handler for com.workday.esb.wcc.RepositoryDocumentsXMLStepImpl,
Workday Studio updated Sep 2026
3lookups
✓verified
Studio WorkdayOutREST GET on Custom Object Returns 404 Until the Record Is Manually Edited
java.io.IOException: Unable to get data from https://wd5-impl-services1.workday.com/ccx/api/v1/[tenant]/customObjects/[CO]/Supplier_ID=zzz with Token=eyJ0eXAiOiJhdCtKV1QiLCJhbGciOiJSUzUxMiJ9... Reason
Workday Studio updated Aug 2026
3lookups
✓verified
Studio Eval Step Fails to Deploy With "unterminated literal" From a Semicolon in a String
Failed to deploy - Error thrown when creating handler for step {http://www.capeclear.com/assembly/10}eval, reason: Error eval step id=extract-combo expression=props['log'] = props['log'] + 'Processing
Workday Studio updated Sep 2026
3lookups
✓verified
Incomplete Output Stream on the Next POST After One Fails
java.io.IOException: Incomplete output stream
Workday Studio updated Sep 2026
3lookups
✓verified
Studio MVEL xpath() Cannot Resolve a count() When the Namespace Argument Is Packed Inside the Expression String
MVEL Expression Error : unable to resolve property: parts[0].xpath("count('/wd:Report_Data/wd:Report_Entry/wd:Position_ID','wd urn:com.workday.report/bsvc')")
Workday Studio updated Sep 2026
3lookups
✓verified
Studio Assembly Fails to Deploy: "No Bean Named vm://... Is Defined"
Failed to deploy - Unexpected runtime error during build of assembly for application=<APP_NAME>. Reason: No bean named 'vm://wcc/PutIntegrationMessage' is defined.
Workday Studio updated Sep 2026
3lookups
✓verified
Studio ApplyXSLT Step Fails to Compile Stylesheet That Works Standalone
Xslt step id=ApplyXSLT stylesheet mctx:vars/dt.var.intsys.stylesheet located at mctx:vars/dt.var.intsys.stylesheet is invalid or missing, reason: javax.xml.transform.TransformerConfigurationException:
Workday Studio updated Aug 2026
3lookups
✓verified
Studio Driver Project Can't Find an External Project's Local-In After Redeploy
com.capeclear.mediation.MediationException: application=<CALLING_APP> - Invalid application '<REFERENCED_APP>' in local-out transport with id='InitializeI-9BIRT' and endpoint='vm://<REFERENCED_APP>/in
Workday Studio updated Sep 2026
3lookups
✓verified
Workday Out Returns 404 notfound When an Assembly Defines Two Report Services
Integration Failed. com.capeclear.mediation.MediationException: application=<APP_NAME> - Workday Out transport id=Emp_RAAS_Call encountered problem sending to endpoint 'https://wd5-impl-services1.work
Workday Studio updated Sep 2026
3lookups
✓verified
Attachment Extraction Utility Fails With 404 on Report Service URL
An unexpected error occurred while processing the Attachment report:error from returned HTTP status: 404 Not Found URL=https://wd2-impl-services1.workday.com/ccx/service/...
Workday Studio updated Aug 2026
2lookups
✓verified
Workday Out REST Connection Reset From Leftover HTTP Headers
An I/O error occurred sending to https://wd2-impl-services1.workday.com/ccx/service/customreport2/TENANT/OWNER/ReportNAME?ApplicationID=ExpectedValue: Connection reset (esbHttpRequestId=1c074058-7170-
Workday Studio updated Aug 2026
2lookups
✓verified
Studio HTTP-Out Step Returns 500 BadRequestException After a Set-Headers Step
com.capeclear.mediation.MediationException: application=<APP_NAME> - Http Out transport id=HttpOut encountered error sending to endpoint Root Cause: BadRequestException : Error code : unknown Respon
Workday Studio updated Sep 2026
2lookups
✓verified
Studio Prism Integration Fails With NullPointerException on Bucket Create
Integration Failed. com.capeclear.mediation.MediationException: application=<APP_NAME> - Custom step id=GenerateCreateBucketRequest, ref=GenerateCreateBucketRequest - Error while invoking bean, reason
Workday Studio updated Sep 2026
2lookups
✓verified
Studio Step Fails: Trying to Write END_DOCUMENT When Document Has No Root
Data is described as XML, but may not be: Trying to write END_DOCUMENT when document has no root (ie. trying to output empty document).
Workday Studio updated Sep 2026
1lookups
✓verified
Studio MVEL Returns No Conversion for TreeMap$Values When Accessing Multiple Report Services
There is no conversion for the evaluation return type of 'java.util.TreeMap$Values', Object.toString()= [
Workday Studio updated Sep 2026
1lookups
✓verified
Studio Integration Gets HTTP 400 With an HTML Error Page While the Same Call Works in Postman
error from returned HTTP status: 400 <!DOCTYPE html>
Workday Studio updated Sep 2026
1lookups
✓verified
Studio BIRT Print Step Fails with Invalid Application PrintService in Local-Out Transport
Integration Failed. com.capeclear.mediation.MediationException: application=<APP_NAME> - Invalid application 'PrintService' in local-out transport with id='Call_PS_PutMessage' and endpoint='vm://Print
Workday Studio updated Sep 2026
1lookups
✓verified
Workday Out Returns invalid username or password After an Upstream External API Call Left Its Headers Set
Integration Failed. com.capeclear.mediation.MediationException: application=<APP_NAME> - Workday Out transport id=IntegrationsWebServiceNoStoreMessage encountered problem sending to endpoint 'https://
Workday Studio updated Sep 2026

Workday Extend 22 errors

6lookups
✓verified
Extend PMD Failed to Resolve a Definition
PMD error: failed to resolve 'workerCard' in presentation model definition appWorkerView
Workday Extend updated Jul 2026
6lookups
✓verified
Extend PMD 'Unknown Variable' Error When Clearing a Widget Value With Double Quotes
Exception thrown while processing 'onChange' event in tag of type 'radioGroup' with id 'ExemptionReason' declared at 'reviseEvent'
Workday Extend updated Aug 2026
6lookups
✓verified
Extend Edit Page Returns a Bare Internal Server Error on Submit
Internal Server Error
Workday Extend updated Sep 2026
6lookups
✓verified
Extend PMD Fails to Compile: Failed to Generate WUL From PMD Snippet
Failed to generate WUL from PMD snippet... Exception: A failure occurred while processing your request. Contact your administrator.
Workday Extend updated Sep 2026
5lookups
✓verified
Extend PMD App Attribute Reference Fails With Unknown Variable
Internal Server Error. [F5S|********|********]
Workday Extend updated Sep 2026
5lookups
✓verified
Prism Dataset Load Fails with "Failed While Retrieving Data From the Source"
Failed while retrieving data from the source.
Workday Extend updated Jul 2026
5lookups
✓verified
Custom Validation Error Not Displayed in Extend App (PMD Binding Typo)
Page Error: invalid request: validation errors
Workday Extend updated Jul 2026
5lookups
✓verified
Extend Orchestration: JSON Path Binding Inserts a Leading Space, Invalidating the WID
<wd:Worker_Reference>
Workday Extend updated Jul 2026
5lookups
✓verified
Extend Model Component Build Fails With Generic Exception, Real Cause Hidden in Extend Logs Tab
java.lang.Exception: Build failed with an error. Check the build logs in the Workday Extend Tool Window for additional information.
Workday Extend updated Aug 2026
3lookups
✓verified
Extend App Job Requisition Retrieval Fails with "Content Is Not Allowed in Prolog" XSLT Error
STUDIO ERROR: Content is not allowed in prolog.
Workday Extend updated Aug 2026
3lookups
✓verified
Extend Expression Parser Rejects 'for' as a Property Name (Reserved Word Conflict)
WelTokenType.identifier expected, got 'for'
Workday Extend updated Aug 2026
2lookups
✓verified
Extend Business Object Build Fails with Multiple Model Validation Errors on Deploy
Validation Error: invalid security domain [mySecurityDomain] in business object [Widgets]
Workday Extend updated Aug 2026
2lookups
✓verified
Extend App Version Stays In-Flight and Waiting To Be Scheduled
Version: In-flight
Workday Extend updated Sep 2026
2lookups
✓verified
Extend App Model Component Won't Install Until Next Weekly Update
The app can't be installed because an app component isn't available in the tenant. The app component will be installed with the next weekly update.
Workday Extend updated Aug 2026
2lookups
✓verified
Extend REST API Custom Object PUT Fails With Misleading 403 Insufficient Permissions
"error": "user has insufficient permissions" STATUS 403 Forbidden
Workday Extend updated Aug 2026
2lookups
✓verified
PMD Validations Tag Fails with Unknown Property Found Error After Switching from EL to PMD Scripting
Page Error - Internal Server Error. [F5Sl********l********] Unknown Property found: value Script Excerpt: string:length(txtArea.value) <= 5000
Workday Extend updated Sep 2026
2lookups
✓verified
Extend App RaaS Report Call Times Out for Non-Admin Users
org.springframework.web.client.ResourceAccessException: I/O error on GET request for "https://api.workday.com/raas/<ISU_NAME>/<REPORT_ALIAS>": Read timed out; nested exception is java.net.SocketTimeou
Workday Extend updated Sep 2026
2lookups
✓verified
Extend Custom Business Object Instance Shows No Task Runner When Clicked
no task runner
Workday Extend updated Sep 2026
2lookups
✓verified
Extend App Fails to Download on Windows After Being Deployed From Mac
Unable to fetch app(s)
Workday Extend updated Aug 2026
1lookups
✓verified
Extend Custom Object PATCH Returns 403 Forbidden When the Body Carries Escaped HTML
403 Forbidden
Workday Extend updated Sep 2026
1lookups
✓verified
Convert Report to WQL Fails: This Field Is Missing an Adhoc Alias
This field is missing an adhoc alias
Workday Extend updated Sep 2026
1lookups
✓verified
Extend PMD Endpoints Never Register Because the Key Is Lowercase
Unknown Variable found: scorecards
Workday Extend updated Sep 2026

Orchestrate 7 errors

Core Connectors 15 errors

6lookups
✓verified
Core Connector Produced No Output (Change Detection)
Integration event completed. 0 records written to output. Change detection found no eligible changes since last successful run.
Core Connectors updated Jun 2026
6lookups
✓verified
Document Retrieval Fails When One of Several File Name Patterns Matches Nothing
Error evaluating expression: org.mvel.ExecutableAccessor@1a0a09b4 reason : unable to resolve property: da.toVar('*.*', 'wd.retrieve.variable')
Core Connectors updated Sep 2026
5lookups
✓verified
Core Connector SFTP-Out Delivery Fails with "Connection Timed Out"
Failed to deliver document 'EmployeeConnector_output_831.csv.pgp' to endpoint 'sftp://wdfs.--------'. Reason: SFTP-Out transport id=SftpOutTransportSingleAuth, cannot login as user ... to host=wdfs.--
Core Connectors updated Sep 2026
5lookups
✓verified
"The Task Submitted Is Not Authorized" on Integration Launch
The task submitted is not authorized for this user. Integration cannot be launched.
Core Connectors updated Jul 2026
5lookups
✓verified
Core Connector Document Retrieval PGP Decrypt Fails After Key Rotation (Stale Encrypted File)
PGP Error: Secret key for message not found. Possibly wrong key used to decrypt.
Core Connectors updated Aug 2026
3lookups
✓verified
Core Connector Delivery Fails: "HTTPPost Failed With SOAP Fault"
HTTPPost failed with SOAP Fault
Core Connectors updated Jun 2026
3lookups
✓verified
Object Transporter Migration of a Core Connector Fails: ISU User Name Required
SOAP-ENV:Client.validationError : Validation error occurred. A User Name is required when creating or updating an Integration System User.
Core Connectors updated Aug 2026
3lookups
✓verified
Core Connector Launch Parameter: Invalid ID Value Not Valid for Parameter_Name
Invalid ID value. 'Outsourced Payment Group Id' is not a valid ID value for type = 'Parameter_Name'
Core Connectors updated Aug 2026
3lookups
✓verified
Core Connector: Organization Outbound Fails to Launch on the Agent (Missing Web Service Access)
Job failed to launch on the agent.
Core Connectors updated Aug 2026
2lookups
✓verified
Core Connector Background Check Outbound: TransformBGData ApplyETV Error
An unexpected error occurred while processing background event BACKGROUND_CHECK_EVENT-3-6632
Core Connectors updated Aug 2026
2lookups
✓verified
Core Connector Worker Fails Mid-Run: The Call to Get_Workers Failed, Task Submitted Is Not Authorized
The call to the Get_Workers web service operation failed. This may be related to insufficient privileges held by the user account configured for the integration. The reported problem was: Processing e
Core Connectors updated Sep 2026
2lookups
✓verified
Core Connector Worker Cannot Obtain the List of Workers With Data Changes
The integration encountered an error which prevented it obtaining the list of workers with data changes.
Core Connectors updated Sep 2026
1lookups
✓verified
SFTP-Out Delivery Fails With Failed to Open Local File While the Remote File Is Locked
Failed to deliver document '<FILENAME>.csv.pgp' to endpoint '<ENDPOINT>'. Reason: application=<APP_NAME> - SFTP-Out transport-id=SftpOutTransportSingleAuth failed to write file=... path=.... Reason: F
Core Connectors updated Sep 2026
1lookups
✓verified
Core Connector Empower Retirement Savings Inbound: Worker Not Eligible for 457B
SOAP-ENV:Client.validationError / Validation error occurred. <Worker> is not eligible for 457B - Empower / Element 6$29774 Restricted by 103$10324 / Xpath: /wd:Enroll_in_Retirement_Savings_Plans_Reque
Core Connectors updated Aug 2026
1lookups
✓verified
Accounting Journal Inbound Ignores a Worktag Column In the CSV File
Spend Category is missing.
Core Connectors updated Sep 2026

EIB 14 errors

7lookups
✓verified
EIB Completed With Errors: Row-Level Failures
Integration event completed with errors. [NUM] of [NUM] records failed. See the output document for details.
EIB updated Jul 2026
7lookups
✓verified
EIB Load Fails: Spreadsheet Template Out of Date
The file does not match the current template version. Please regenerate the spreadsheet template and try again.
EIB updated Jun 2026
5lookups
✓verified
EIB/Integration Launch Fails: "Response 500 - The Task Submitted Is Not Authorized"
Response :500 : Processing error occurred. The task submitted is not authorized.
EIB updated Jun 2026
4lookups
✓verified
EIB Migration Fails: Transport Protocol Validation Error
SOAP-ENV:Client:ValidationError: Validation Error Occured. If a value for ID is not provided, or the ID does not represent an existing Transport Protocol, then 2 of the Transport Protocol Data sub-ele
EIB updated Jul 2026
4lookups
✓verified
EIB Put Compensation Eligibility Rule: Invalid Instance From Mismatched WID Columns
Invalid instance 1633$51 for Condition_Item__All_.source_External_Field--IS (3$3672).
EIB updated Aug 2026
4lookups
✓verified
Hire EIB Rejects Location Due to Organization, Position, or Headcount Group Restriction
Validation error occurred. Location does not meet the restrictions for the proposed organization, position or headcount group.
EIB updated Aug 2026
4lookups
✓verified
Compensation Eligibility EIB Fails on Cross-Tenant Load with Any-in-Selection-List Operator
The entered information does not meet the restrictions defined for this field. (Relational_Operator_Reference).
EIB updated Aug 2026
4lookups
✓verified
Put Organization Assignment Restrictions Request EIB Fails on Default_Organization_Reference
The entered information does not meet the restrictions defined for this field. (Default_Organization_Reference).
EIB updated Aug 2026
4lookups
✓verified
Edit Job Requisition EIB Fails Restriction Check on a Field the Load Never Touches
Validation error occurred. The entered information does not meet the restrictions defined for this field (Additional_Locations_Reference).
EIB updated Sep 2026
3lookups
✓verified
New Hire EIB Fails With Element Content Type_Data Is Required Error
Validation error occurred. Element Content 'Type_Data' is required, on internal element 'Communication Method Usage Information'
EIB updated Aug 2026
3lookups
✓verified
Change Job EIB Fails Restriction Check on Additional Job Classifications
The entered information does not meet the restrictions defined for this field. (Additional_Job_Classifications_Reference).
EIB updated Aug 2026
2lookups
✓verified
EIB Goal Load Fails With Invalid Rich Text Internal Syntax Error
Validation error occurred. Invalid Rich Text internal syntax: Unexpected char in markup at 203.
EIB updated Aug 2026
1lookups
✓verified
EIB Change Benefits Load Fails With Too Few Dependents Selected For Coverage Level
TOO FEW DEPENDENTS SELECTED FOR COVERAGE LEVEL.
EIB updated Aug 2026
1lookups
✓verified
EIB Leave Correction Fails With Duplicate Leave Event ID
Validation error occurred. The Leave Event ID you have specified already exists in the system, please ensure when adding a new Leave Event the ID used is unique.
EIB updated Aug 2026

RaaS (Reports as a Service) 16 errors

6lookups
✓verified
RaaS Report Not Found Because The Report Is Not Shared With The Calling ISU
400: Validation error occured. Report not found=urn:com.workday.report/ISU_ServiceNow/getWorkerInfo
RaaS (Reports as a Service) updated Sep 2026
6lookups
✓verified
RaaS Call Returns Action Denied Because the Report Was Never Published as a Web Service
Action: denied
RaaS (Reports as a Service) updated Sep 2026
4lookups
✓verified
RaaS Returns a Login Page Instead of Report Data
Expected XML/JSON response but received: <!DOCTYPE html><html><head><title>Workday Sign In</title>...
RaaS (Reports as a Service) updated Jun 2026
4lookups
✓verified
RaaS SOAP Report Call Rejects Date Prompt with Invalid Format Error
Validation error occurred. Invalid format for date text= 2021-01-01 on attr Prompt - Date 1
RaaS (Reports as a Service) updated Aug 2026
3lookups
✓verified
RaaS Call From Studio Fails With QName Validation Error From a Stray Question Mark in Extra Path
com.capeclear.capeconnect.transport.BadRequestException: error from returned HTTP status: 500 400 : Validation error occurred. Element or attribute do not match QName production: QName::=(NCName':')?N
RaaS (Reports as a Service) updated Jul 2026
3lookups
✓verified
RaaS Report Call Fails with "Time Out Exceeded" on HTTP GET
HTTP GET on resource "https://.../ccx/service/customreport2/.../xxxxx" failed: Time out exceeded
RaaS (Reports as a Service) updated Jul 2026
3lookups
✓verified
RaaS Call From Studio Fails With HTTP 505 Due to Unencoded Space in Extra Path Value
com.capeclear.capeconnect.transport.BadRequestException: error from returned HTTP status: 505 Root Cause: BadRequestException : Error code : unknown
RaaS (Reports as a Service) updated Jul 2026
2lookups
✓verified
Studio RaaS Call Returns 404 Not Found With Multiple Report Services on One Component
com.capeclear.capeconnect.transport.BadRequestException: error from returned HTTP status: 404 Not Found URL=https://wd5-impl-services1.workday.com/ccx/service/
RaaS (Reports as a Service) updated Jul 2026
2lookups
✓verified
RaaS Over OAuth Returns 500 Not Authorized While Basic Auth Works
500: Processing error occurred. The task submitted is not authorized.
RaaS (Reports as a Service) updated Sep 2026
2lookups
✓verified
RaaS/Integration OAuth2 Token Request Returns 401 Even With Correct Credentials
HTTPError: 401 Client Error: Unauthorized for url: https://wd5-impl-services1.workday.com/ccx/oauth2/<TENANT>/token.
RaaS (Reports as a Service) updated Sep 2026
2lookups
✓verified
RaaS Call From Studio Returns 400 Report Not Found Because the Owner Segment Contains Spaces
Response :400 : Validation error occurred. Report not found=urn:com.workday.report/<ISU NAME WITH SPACES>/<INTEGRATION_NAME>null
RaaS (Reports as a Service) updated Sep 2026
2lookups
✓verified
RaaS Extra Path Call Fails with 505 When a Business Site Prompt Value Contains a Comma
Integration Failed. com.capeclear.mediation.MediationException: Workday Out transport id=Find_Country_ISO_Code encountered problem sending to endpoint '...'. Details: BadRequestException : Error code
RaaS (Reports as a Service) updated Aug 2026
2lookups
✓verified
RaaS Call From Browser JavaScript Blocked by CORS Policy
Access to XMLHttpRequest at <RaaS URL> from origin <company domain> has been blocked by CORS policy: No 'Access-Control-Allow-Origin' header is present on the requested resource.
RaaS (Reports as a Service) updated Aug 2026
1lookups
✓verified
RaaS 400 Validation Error Naming A Disjunctive-Secured Organization Data Source
400 : Validation error occurred. The entered information does not meet the restrictions defined for this field. (Organizations for Worker Reporting Secured with Allow Disjunctive Security Enabled)
RaaS (Reports as a Service) updated Sep 2026
1lookups
✓verified
RaaS Report Returns 500 Task Not Authorized While the Same Report Opens Fine in the UI
500 : Processing error occurred. The task submitted is not authorized.
RaaS (Reports as a Service) updated Sep 2026
1lookups
✓verified
RaaS 401 Error Returns Plain Text Instead of Requested XML Format
curl -H 'Accept: text/xml' 'https://...(url to report)&format=xml', it returns a plain text error 401 : invalid username or password
RaaS (Reports as a Service) updated Aug 2026

PECI / PICOF 14 errors

6lookups
✓verified
Payroll Outbound Fails: No Value Output for Required Field When the Primary Address Lacks the Expected Usage Type
No value output for required field PAYROLL Worker Home Address 1
PECI / PICOF updated Sep 2026
6lookups
✓verified
PECI Worker Skipped: Unprocessed Prior Event
Worker [ID]: change not processed. A prior effective-dated event for this worker is pending in an unconfirmed state.
PECI / PICOF updated Jul 2026
4lookups
✓verified
Custom Integration Field Override Service Fails: Entered Information Does Not Meet Restrictions
Error - Custom Integration Services (Row 1)
PECI / PICOF updated Aug 2026
4lookups
✓verified
Payroll Interface Extract Fails Without a Subsequent Pay Period
The following unexpected error has occurred: Payroll extract cannot be performed unless the Current Payroll Period(Payperiodstartdate, payperiodenddate)has a Subsequent Pay Period.
PECI / PICOF updated Sep 2026
3lookups
✓verified
PICOF Integration Fails with Java Socket Timeout or Connection Reset
Error: javax.xml.ws.WebServiceException: java.net.SocketTimeoutException: Read timed out
PECI / PICOF updated Jun 2026
3lookups
✓verified
PECI Merge Files Integration Fails: "The Task Submitted Is Not Authorized" (ISU Domain Gap)
Processing error occurred. The task submitted is not authorized.
PECI / PICOF updated Jul 2026
3lookups
✓verified
PICOF Extract Skips Payee: "Must Have a Position Assigned to at Least One Payroll Interface Pay Group"
There is an issue with the Payee [ID] which has prevented it from being included in the payroll extract: Payee must have a Position assigned to at least one Payroll Interface Pay Group
PECI / PICOF updated Jul 2026
3lookups
✓verified
PECI Fails: Tenant Not Enabled to Run a Data Initialization Service That Utilizes Effective Changes
Your tenant is not enabled to run a Data Initialization Service that utilizes Effective Changes.
PECI / PICOF updated Sep 2026
3lookups
✓verified
Payroll Connector Fails: An Organization With WID Value Was Not Found for the Pay Group
The following unexpected error has occurred: An Organization with WID value of <WID> was not found - <WID> = WID for US company pay group
PECI / PICOF updated Sep 2026
2lookups
✓verified
PICOF Connector Output to Studio Integration Fails With No File Found
The output document of PICOF connector is sent over to Studio Integration. The issue is though PICOF generates the xml file, the studio integration fails to get the file. Studio integration ends with
PECI / PICOF updated Aug 2026
2lookups
✓verified
PICOF Primary Run Fails: "Entered Information Does Not Meet the Restrictions" on Pay Group Update
The following unexpected error has occurred: Validation error occurred. The entered information does not meet the restrictions defined for this field. (Integration_System_Reference).
PECI / PICOF updated Jul 2026
2lookups
✓verified
PICOF Extract Fails With java.lang.ClassCastException When a Payee Cannot Be Included
There is an issue with the Payee which has prevented it from being included in the payroll extract: java.lang.ClassCastException@1f784d6e
PECI / PICOF updated Aug 2026
2lookups
✓verified
PECI Event-Driven Integration Fails With HTTP 415 Unsupported Media Type
Summary: An error occurred while attempting to deliver the EDI document to the vendor.
PECI / PICOF updated Aug 2026
1lookups
✓verified
PECI Fails With Multiple Summary DIS Documents When Runs Are Chained
The following unexpected error has occurred: Multiple Payroll Effective Change Interface - Summary DIS documents found! Should only be one!
PECI / PICOF updated Sep 2026